concepts in educational reform
type: Concept
narrower: Paideia Proposal

Paideia Proposal
type: Concept
definition: Grounded in the democratic principle of equality, the educational system known as the Paideia Proposal was set forth in philosopher and scholar Mortimer J. Adler's book, The Paideia Proposal: An Educational Manifesto. It was introduced at a time when the quality of the American educational system was coming under fierce attack. [Source: Encyclopedia of Educational Reform and Dissent; Paideia Proposal]
broader: concepts in educational reform

concepts
type: Collection
type: ConceptGroup
member: Paideia Proposal