Paolo Mancini
type: Concept
definition: Paolo Mancini is a specialist in political communication whose work focuses on comparative analysis of the relation between mass media and political systems. He has written numerous works on media and politics in Italy, studies comparing American and Italian television news and, with Daniel Hallin, a comparative study of media and politics in Western Europe and North America, Comparing Media Systems: Three Models of Media and Politics (2004). [Source: Encyclopedia of Political Communication; Mancini, Paolo (1948–)]
broader: key people in political communication

key people in political communication
type: Concept
narrower: Paolo Mancini

people
type: Collection
type: ConceptGroup
member: Paolo Mancini