statistics and data mining
type: Concept
narrower: Pareto chart

methods
type: Collection
type: ConceptGroup
member: Pareto chart

Pareto chart
type: Concept
definition: The Pareto chart, or Pareto diagram, is one of the seven basic tools of quality improvement. It is named after the Italian economist Vilfredo Pareto (1848–1923), who observed that a small minority of Italian citizens held the majority of the wealth and means of production. [Source: Encyclopedia of Health Care Management; Pareto Chart]
broader: statistics and data mining