Peru
type: Concept
definition: Peru, which lies on the Pacific shores of South America, has an extensive religious history that can be divided into three periods: Inca, colonial, and national. Prior to the arrival of the Spanish conquistadors in the 16th century, the Incan Empire (Tawantinsuyu) spanned most of western South America. [Source: Encyclopedia of Global Religion; Peru]
broader: South America

South America
type: Concept
narrower: Peru

concepts
type: Collection
type: ConceptGroup
member: Peru