Portugal
type: Concept
definition: Portugal is a European nation that shares the Iberian Peninsula with neighboring Spain. Its 2009 population stood at 10,657,000. [Source: Sociology of Education: An A-to-Z Guide; Portugal]
broader: Europe

Europe
type: Concept
narrower: Portugal

concepts
type: Collection
type: ConceptGroup
member: Portugal