institutions studying climate change
type: Concept
narrower: Renewable Energy Policy Project

Renewable Energy Policy Project
type: Concept
definition: FOUNDED IN 1995, the Renewable Energy Policy Project (REPP) is based in Washington, D.C. The organization researches strategies to make renewable sources competitive in energy markets and to stabilize carbon emissions. [Source: Encyclopedia of Global Warming and Climate Change; Renewable Energy Policy Project (REPP)]
broader: institutions studying climate change

concepts
type: Collection
type: ConceptGroup
member: Renewable Energy Policy Project