SRI International
type: Concept
definition: SRI International is an organization known for innovation, investigation, and consulting. This research-and-design (R&D) institution has developed advanced technologies for more than 55 years, contributing to the creation of many products, pharmaceuticals, and computer tools currently used in countless areas. [Source: Encyclopedia of New Media; SRI International]
broader: organizations and labs

organizations and labs
type: Concept
narrower: SRI International

organizations
type: Collection
type: ConceptGroup
member: SRI International