criminals
type: Concept
narrower: Sam Sheppard

Sam Sheppard
type: Concept
definition: Sam Sheppard (1923–70) was an osteopathic physician and neurosurgeon turned professional wrestler who was convicted of murdering his pregnant wife Marilyn in 1954. He served 10 years of a life sentence before his conviction was overturned. [Source: The Social History of Crime and Punishment in America: An Encylopedia; Sheppard, Sam]
broader: criminals

people
type: Collection
type: ConceptGroup
member: Sam Sheppard