Samuel Dash
type: Concept
definition: Samuel Dash (1925–2004) was a longtime law professor at Georgetown University, author of books on the Fourth Amendment, and, most notably, the U.S. Senate's chief counsel during the Watergate hearings in the 1970s. Born in 1925 in Camden, New Jersey, to Russian immigrants, Samuel Dash earned his undergraduate degree from Temple University in 1947 after serving in World War II. He later graduated from Harvard Law School in 1950 and served as a teaching associate at Northwestern University. [Source: Encyclopedia of the Fourth Amendment; Dash, Samuel]
broader: key people in the Fourth Amendment

key people in the Fourth Amendment
type: Concept
narrower: Samuel Dash

people
type: Collection
type: ConceptGroup
member: Samuel Dash