key people in modern political thought
type: Concept
narrower: Samuel Taylor Coleridge

Samuel Taylor Coleridge
type: Concept
definition: Samuel Taylor Coleridge was one of the most influential poets and critics of the 19th century. Considered one of the founders of the Romantic movement in England, he is best known for his poems The Rime of the Ancient Mariner and Kubla Khan. [Source: Encyclopedia of Time: Science, Philosophy, Theology, & Culture; Coleridge, Samuel Taylor (1772–1834)]
broader: key people in modern political thought

people
type: Collection
type: ConceptGroup
member: Samuel Taylor Coleridge