staff
type: Concept
narrower: Sanford Bates

Sanford Bates
type: Concept
definition: Sanford Bates was one of the preeminent penologists in the United States. He was particularly known for his support of rehabilitation and many related reforms and innovations. [Source: Encyclopedia of Prisons & Correctional Facilities; Bates, Sanford (1884–1972)]
broader: staff

people
type: Collection
type: ConceptGroup
member: Sanford Bates