Middle East
type: Concept
narrower: Saudi Arabia

Saudi Arabia
type: Concept
definition: Saudi Arabia adheres to Sharia law's regulation of divorce, which is based on the teachings of Allah, the Prophet Muhammad, and Islamic scholars. The Islamic religion, which governs marriage and family relationships in Saudi Arabia, permits divorce but regards it as highly undesirable. [Source: Cultural Sociology of Divorce: An Encyclopedia; Saudi Arabia]
broader: Middle East

concepts
type: Collection
type: ConceptGroup
member: Saudi Arabia