concepts
type: Collection
type: ConceptGroup
member: Spain

Spain
type: Concept
definition: Spain had a tumultuous history during the 20th century. Struggling to adapt to the forces of modernization, Spain suffered a civil war between 1936 and 1939. [Source: The SAGE Encyclopedia of World Poverty; Spain]
broader: Europe

Europe
type: Concept
narrower: Spain