prisoners
type: Concept
narrower: Stephen Donaldson

Stephen Donaldson
type: Concept
definition: Stephen Donaldson, the first American jailhouse rape survivor to discuss his experience publicly, spent many years of his life working to expose the problem of sexual assault in U.S. correctional institutions. He also served as the president of the group Stop Prisoner Rape from 1988 to his death in 1996. [Source: Encyclopedia of Prisons & Correctional Facilities; Donaldson, Stephen (1946–1996)]
broader: prisoners

people
type: Collection
type: ConceptGroup
member: Stephen Donaldson