institutions studying climate change
type: Concept
narrower: Stockholm Environment Institute

organizations
type: Collection
type: ConceptGroup
member: Stockholm Environment Institute

Stockholm Environment Institute
type: Concept
definition: THE STOCKHOLM ENVIRONMENT Institute (SEI) is a nonprofit, independent research institute specializing in sustainable development and environmental issues. SEI headquarters are located in Stockholm, Sweden, with centers in the United States and the United Kingdom. [Source: Encyclopedia of Global Warming and Climate Change; Stockholm Environment Institute (SEI)]
broader: institutions studying climate change