Stratego
type: Concept
definition: Stratego, a board game with many ancestors, relies solely on strategy to win. Game theorists refer to Stratego as having imperfect information (not all players have access to the same information because one cannot see the opponent's pieces) and abstract strategy (not a simulation or involving any elements of luck). [Source: Encyclopedia of Play in Today's Society; Stratego]
broader: board games

board games
type: Concept
narrower: Stratego

concepts
type: Collection
type: ConceptGroup
member: Stratego