Sweden
type: Concept
definition: Sweden is a northern European nation bordering the Baltic Sea between Finland and Norway. With 2.1 percent of the population between the ages of 15 and 64 using cannabis annually, Sweden has relatively low rates of illegal drug use, and is not a major factor in the international illicit drug distribution system. [Source: Encyclopedia of Drug Policy; Sweden]
broader: Scandinavia

Scandinavia
type: Concept
narrower: Sweden

concepts
type: Collection
type: ConceptGroup
member: Sweden