Tailhook convention
type: Concept
definition: The Tailhook Convention of 1991 involved the U.S. Navy in a bitter controversy over allegations that officers had engaged in numerous acts of excessive drinking and sexual misconduct. The episode cast a shadow not only on the specific individuals involved, but on the Navy's overall culture—especially its treatment of women. [Source: Encyclopedia of War & American Society; Tailhook Convention]
broader: war and gender

war and gender
type: Concept
narrower: Tailhook convention

events
type: Collection
type: ConceptGroup
member: Tailhook convention