Third World Press
type: Concept
definition: Third World Press (TWP), the oldest and longest running black publishing house, celebrated its 35th anniversary in 2002. Haki R. Madhubuti (formerly Don L. Lee), with the assistance of Carolyn Rodgers and Johari Amini, founded Third World Press on September 20, 1967. [Source: Encyclopedia of Black Studies; Third World Press]
broader: publishers

publishers
type: Concept
narrower: Third World Press

organizations
type: Collection
type: ConceptGroup
member: Third World Press