China
type: Concept
narrower: Tibet

concepts
type: Collection
type: ConceptGroup
member: Tibet

Tibet
type: Concept
definition: Tibetans, who live in what is often called the “Roof of the World,” have been seeking independence from China since 1951. The Tibetan government in exile—led by the Dalai Lama—has drafted several proposed constitutions to promote the movement to achieve the right of self-determination. [Source: Constitutions of the World; Tibet]
broader: China