United Nations agencies
type: Concept
narrower: UN Environment Programme

concepts
type: Collection
type: ConceptGroup
member: UN Environment Programme

UN Environment Programme
type: Concept
definition: The United Nations Environment Programme (UNEP) is the environmental extension of the United Nations (UN). The UNEP fosters and advances partnerships between diverse actors, including other international organizations, national governments, nongovernmental organizations (NGOs), and the private and public sectors. [Source: Encyclopedia of Crisis Management; Environment Programme, UN (UNEP)]
broader: United Nations agencies