Uganda
type: Concept
definition: Uganda, a country where the main religious division has been between Protestants and Catholics, is located in east Africa along the northern shores of Lake Victoria. The majority of the population is Christian, though there is a sizeable Muslim minority. [Source: Encyclopedia of Politics and Religion; Uganda]
broader: Eastern Africa

Eastern Africa
type: Concept
narrower: Uganda

concepts
type: Collection
type: ConceptGroup
member: Uganda