institutions studying climate change
type: Concept
narrower: University of Washington

University of Washington
type: Concept
definition: The University of Washington (UW) is a public research university founded in 1861 in Seattle, Washington, making it one of the oldest universities on the West Coast of the United States. Additional campuses were established at Bothell and Tacoma in 1990. [Source: Green Education: An A-to-Z Guide; University of Washington]
broader: institutions studying climate change

organizations
type: Collection
type: ConceptGroup
member: University of Washington