Walter Cronkite
type: Concept
definition: Walter Leland Cronkite, Jr. spent nearly 19 years as anchor of CBS Evening News and became known as “the most trusted man in America.” Over the years, he won numerous journalism awards. [Source: Encyclopedia of Political Communication; Cronkite, Walter (1916–)]
broader: key people in political communication

key people in political communication
type: Concept
narrower: Walter Cronkite

people
type: Collection
type: ConceptGroup
member: Walter Cronkite