assessment areas and techniques
type: Concept
narrower: Work Values Inventory

Work Values Inventory
type: Concept
definition: Competent career planning is generally understood to rest on a tripod of interests, skills or abilities, and values. Interests and skills or abilities have a long assessment history; assessment of work values has only recently emerged. [Source: Encyclopedia of Career Development; Work Values Inventory]
broader: assessment areas and techniques

concepts
type: Collection
type: ConceptGroup
member: Work Values Inventory