absolute divorce
type: Concept
definition: Absolute divorce is the dissolution or end of a marriage granted by a court of law in all jurisdictions in the United States. Absolute divorce is available to either partner in a legal marriage. [Source: Cultural Sociology of Divorce: An Encyclopedia; Absolute Divorce]
broader: types of divorce

types of divorce
type: Concept
narrower: absolute divorce

concepts
type: Collection
type: ConceptGroup
member: absolute divorce