leadership and management
type: Concept
narrower: abusive supervision

concepts
type: Collection
type: ConceptGroup
member: abusive supervision

abusive supervision
type: Concept
definition: Abusive supervision refers to sustained displays of nonphysical forms of hostility perpetrated by supervisors against their direct reports. Examples of behavior that fall within the abusive supervision content domain include public derogation, undermining, and explosive outbursts. [Source: Encyclopedia of Industrial and Organizational Psychology; Abusive Supervision]
broader: leadership and management