administration theory
type: Concept
definition: There is no single theory of public administration. Rather, public administration theory contains a complex of statements regarding what administration is, the meaning of public, who creates public administration, what the goals of public administration are, and how public administration should fulfill its tasks. [Source: International Encyclopedia of Political Science; Administration Theory]
broader: public administration

public administration
type: Concept
narrower: administration theory

concepts
type: Collection
type: ConceptGroup
member: administration theory