concepts
type: Collection
type: ConceptGroup
member: advertising ethics

advertising ethics
type: Concept
definition: In a modern capitalist society, ads are ubiquitous; criticisms of advertising are nearly as common. Some ethical criticisms concern advertising as a social practice, while others attack specific ads or advertising practices. [Source: Encyclopedia of Business Ethics and Society; Advertising Ethics]
broader: marketing ethics

marketing ethics
type: Concept
narrower: advertising ethics