aging and older development
type: Concept
narrower: aging well

concepts
type: Collection
type: ConceptGroup
member: aging well

aging well
type: Concept
definition: Most adults want to live long, in good health, and with an overall sense of well being. Aging well describes this goal by promoting positive images and approaches to human aging. [Source: Encyclopedia of Human Development; Aging Well]
broader: aging and older development