alcohol treatment programs
type: Concept
definition: Most state prisons and all federal prisons offer some type of substance abuse education or treatment programs to help inmates overcome their addiction to alcohol and other drugs. It is thought that these programs may also help to reduce recidivism. [Source: Encyclopedia of Prisons & Correctional Facilities; Alcohol Treatment Programs]
broader: prison programs

prison programs
type: Concept
narrower: alcohol treatment programs

concepts
type: Collection
type: ConceptGroup
member: alcohol treatment programs