alien abduction
type: Concept
definition: Alien abduction is a familiar theme in popular culture. As described by those who claim to have experienced it, alien abduction (in this entry, abduction, for short) is the physical seizure, or kidnapping, of a human being by an extraterrestrial intelligent being. [Source: Encyclopedia of Science and Technology Communication; Alien Abduction]
broader: challenges, issues, and controversies

challenges, issues, and controversies
type: Concept
narrower: alien abduction

concepts
type: Collection
type: ConceptGroup
member: alien abduction