social science of networking
type: Concept
narrower: alumni networks

concepts
type: Collection
type: ConceptGroup
member: alumni networks

alumni networks
type: Concept
definition: Facebook, MySpace, Twitter, , , and are just some of the many social networking sites that people all over the world use to connect with former classmates. Alumni social networking is becoming increasingly popular among graduates, schools, companies, and organizations. [Source: Encyclopedia of Social Networks; Alumni Networks]
broader: social science of networking