drug classification
type: Concept
narrower: amyl nitrite

concepts
type: Collection
type: ConceptGroup
member: amyl nitrite

amyl nitrite
type: Concept
definition: Amyl nitrite is an inhalant that has recognized medical uses, as well as a history of illicit recreational use. Street names for amyl nitrite include aimes, ames, amys, pearls, and poppers. [Source: Encyclopedia of Substance Abuse Prevention, Treatment, & Recovery; Amyl Nitrite]
broader: drug classification