animation
type: Concept
definition: The illusion of movement created by means of an inanimate object. This illusion is created by what Peter Mark Roget referred to as persistence of vision—after seeing an image, human beings retain it through the afterimage, which creates the appearance of continuity and movement. [Source: The SAGE Glossary of the Social and Behavioral Sciences; Animation]
broader: media forms

media forms
type: Concept
narrower: animation

concepts
type: Collection
type: ConceptGroup
member: animation