concepts in educational reform
type: Concept
narrower: assertive discipline

concepts
type: Collection
type: ConceptGroup
member: assertive discipline

assertive discipline
type: Concept
definition: Since the 1970s, viewpoints and theories about classroom management have proliferated. One of the more widely used of those theories is assertive discipline, developed by Lee and Marlene Canter in 1976. [Source: Encyclopedia of Educational Reform and Dissent; Assertive Discipline]
broader: concepts in educational reform