persons
type: Concept
narrower: athletes

concepts
type: Collection
type: ConceptGroup
member: athletes

athletes
type: Concept
definition: Athletes September 2014 All rights cleared. I hope that it won't be-- I won't do anything new. [Source: Asian American Society: An Encyclopedia; Athletes]
broader: persons