personality
type: Concept
narrower: attachment styles

attachment styles
type: Concept
definition: The concept of attachment was introduced into psychiatry and psychology by John Bowlby, a British psychoanalyst whose major books appeared between 1969 and 1980. Like many psychoanalysts, beginning with Sigmund Freud, Bowlby was interested in the early childhood roots of later personality patterns, including psychological disorders. [Source: Encyclopedia of Social Psychology; Attachment Styles]
broader: personality

concepts
type: Collection
type: ConceptGroup
member: attachment styles