attractiveness
type: Concept
definition: The term attraction can refer to numerous interpersonal factors from liking to love, but it is most commonly used to indicate evaluative judgments of physical attractiveness. Although now prominently featured in journals of many disciplines, the scientific study of attraction is a relative newcomer to psychology. [Source: Encyclopedia of Perception; Attractiveness]
broader: visual perception

visual perception
type: Concept
narrower: attractiveness

concepts
type: Collection
type: ConceptGroup
member: attractiveness