audition
type: Concept
narrower: auditory masking

auditory masking
type: Concept
definition: Auditory masking refers to the situation in which one sound reduces a listener's ability to detect or discriminate another sound. We are all familiar with situations in which what we are trying to hear is obscured by the presence of other sounds. [Source: Encyclopedia of the Mind; Auditory Masking]
broader: audition

concepts
type: Collection
type: ConceptGroup
member: auditory masking