awe
type: Concept
definition: Definition Awe refers to an intense emotional response people may have when they encounter an object, event, or person that is extraordinary. Things that elicit awe are typically vast in size, significance, or both. [Source: Encyclopedia of Social Psychology; Awe]
broader: emotion

emotion
type: Concept
narrower: awe

concepts
type: Collection
type: ConceptGroup
member: awe