bananas
type: Concept
definition: In 1870, a strange fruit became a novelty purchase in New York food markets. By 1904, bananas had become the most popular fruit in the United Kingdom, and growing demand for bananas in North America and Europe lay the foundation for profound and ongoing environmental and social impacts in producer countries. [Source: Encyclopedia of Environment and Society; Bananas]
broader: agriculture

agriculture
type: Concept
narrower: bananas

concepts
type: Collection
type: ConceptGroup
member: bananas