social cognition
type: Concept
narrower: base rate fallacy

concepts
type: Collection
type: ConceptGroup
member: base rate fallacy

base rate fallacy
type: Concept
definition: Definition Imagine that you meet Tom one evening at a party. He is somewhat shy and reserved, is very analytical, and enjoys reading science fiction novels. [Source: Encyclopedia of Social Psychology; Base Rate Fallacy]
broader: social cognition