behavioral intervention plans
type: Concept
definition: The behavioral intervention plan (BIP) is related to the requirements of the Individuals with Disabilities Education Act (IDEA). The professional literature in special education is replete with research and recommendations for developing BIPs, based on functional behavioral assessments (FBAs) and positive behavioral strategies, as the primary means for controlling and improving the conduct of students with disabilities that interfere with their learning or that of others. [Source: Encyclopedia of Education Law; Behavioral Intervention Plan]
broader: special education techniques

special education techniques
type: Concept
narrower: behavioral intervention plans

concepts
type: Collection
type: ConceptGroup
member: behavioral intervention plans