best English to learn
type: Concept
definition: When discussing the educational needs of English language learners (ELLs), one of the topics frequently discussed is the kind or variety of English such individuals need to learn to be successful in an English-speaking society. This is not an issue that pertains only to students who speak a language other than English, although for them, the stakes may be somewhat higher. [Source: Encyclopedia of Bilingual Education; Best English to Learn]
broader: teaching and learning

teaching and learning
type: Concept
narrower: best English to learn

concepts
type: Collection
type: ConceptGroup
member: best English to learn