nonviolent crimes
type: Concept
narrower: bicycle theft

bicycle theft
type: Concept
definition: Bicycle theft is defined as the unlawful taking of a nonmotorized pedal cycle. Typically this refers to the theft of an entire bicycle, but can also include theft of component parts and accessories. [Source: Encyclopedia of Street Crime in America; Bicycle Theft]
broader: nonviolent crimes

concepts
type: Collection
type: ConceptGroup
member: bicycle theft