creativity studies
type: Concept
narrower: bilingualism and creativity

bilingualism and creativity
type: Concept
definition: Throughout the history of human civilization, numerous attempts to understand human creativity have been made. Interest in human creative capacity has never ceased, and contemporary creativity researchers are still debating the nature of creativity. [Source: Encyclopedia of Giftedness, Creativity, and Talent; Bilingualism and Creativity]
broader: creativity studies

concepts
type: Collection
type: ConceptGroup
member: bilingualism and creativity