birthmarks
type: Concept
definition: Birthmarks are a common finding in children. Typically, birthmarks are different types of noncancerous vascular tissue. [Source: Encyclopedia of Global Health; Birthmarks]
broader: localized diseases

localized diseases
type: Concept
narrower: birthmarks

concepts
type: Collection
type: ConceptGroup
member: birthmarks