climatology
type: Concept
narrower: carbonation

carbonation
type: Concept
definition: Carbonation is the chemical reaction that occurs when the mineral calcite, or calcium carbonate (CaCO3), comes in contact with an acid. In the natural environment, where rotting organic matter occurs in soils, the soil water reacts with the carbon dioxide from the organic matter to produce carbonic acid: In turn, the weak carbonic acid that is produced then disassociates or comes apart into smaller atomic particles and compounds: These materials can react in turn with the calcium carbonate. [Source: Encyclopedia of Geography; Carbonation]
broader: climatology

concepts
type: Collection
type: ConceptGroup
member: carbonation