cascading crisis
type: Concept
definition: A cascading crisis is an unexpected event, or series of events, that creates a damaging domino effect of failures within or across systems. Although some cascading crises seem to stem from a single trigger event, others are created by the compounding of multiple interaction effects. [Source: Encyclopedia of Crisis Management; Cascading Crisis]
broader: issues in crisis management

issues in crisis management
type: Concept
narrower: cascading crisis

concepts
type: Collection
type: ConceptGroup
member: cascading crisis